Fedora Linux Support Community & Resources Center
  #1  
Old 5th January 2012, 02:05 PM
seant Offline
Registered User
 
Join Date: Jan 2012
Location: South Africa
Posts: 1
linuxfirefox
QT Help needed for GNS3

Hey all

I am new to the forum and sorry for posting my first topic as a help topic.

I am getting a error when compiling qt-x11-opensource-src-4.5.1 this happens when i use the make command.
My OS is Fedora 15 64bit i need this for GNS3 any help would truly be appreciated.

The error: (THANKS IN ADVANCE)


make[1]: Entering directory `/tmp/qt-x11-opensource-src-4.5.1/src/network'
g++ -c -include .pch/debug-shared/QtNetwork -m64 -pipe -g -fno-exceptions -g -fvisibility=hidden -fvisibility-inlines-hidden -Wall -W -D_REENTRANT -fPIC -DQT_SHARED -DQT_BUILD_NETWORK_LIB -DQT_NO_USING_NAMESPACE -DQT_NO_CAST_TO_ASCII -DQT_ASCII_CAST_WARNINGS -DQT3_SUPPORT -DQT_MOC_COMPAT -DQT_CORE_LIB -D_LARGEFILE64_SOURCE -D_LARGEFILE_SOURCE -I../../mkspecs/linux-g++-64 -I. -I../../include/QtCore -I../../include -I../../include/QtNetwork -I.rcc/debug-shared -Ikernel -I/usr/include -I.moc/debug-shared -I/tmp/qt-x11-opensource-src-4.5.1/src/network/.uic/debug-shared -o .obj/debug-shared/qsslcertificate.o ssl/qsslcertificate.cpp
In file included from ssl/qsslcertificate.cpp:109:0:
ssl/qsslsocket_openssl_symbols_p.h:257:16: error: variable or field ‘q_sk_free’ declared void
ssl/qsslsocket_openssl_symbols_p.h:257:16: error: ‘STACK’ was not declared in this scope
ssl/qsslsocket_openssl_symbols_p.h:257:23: error: ‘a’ was not declared in this scope
ssl/qsslsocket_openssl_symbols_p.h:258:14: error: ‘STACK’ was not declared in this scope
ssl/qsslsocket_openssl_symbols_p.h:258:21: error: ‘a’ was not declared in this scope
ssl/qsslsocket_openssl_symbols_p.h:259:19: error: ‘STACK’ was not declared in this scope
ssl/qsslsocket_openssl_symbols_p.h:259:26: error: ‘a’ was not declared in this scope
ssl/qsslsocket_openssl_symbols_p.h:259:29: error: expected primary-expression before ‘int’
ssl/qsslsocket_openssl_symbols_p.h:259:34: error: expression list treated as compound expression in initializer [-fpermissive]
ssl/qsslcertificate.cpp: In member function ‘QMultiMap<QSsl::AlternateNameEntryType, QString> QSslCertificate::alternateSubjectNames() const’:
ssl/qsslcertificate.cpp:365:5: error: ‘STACK’ was not declared in this scope
ssl/qsslcertificate.cpp:365:12: error: ‘altNames’ was not declared in this scope
ssl/qsslcertificate.cpp:365:31: error: expected primary-expression before ‘)’ token
ssl/qsslcertificate.cpp:365:32: error: expected ‘;’ before ‘q_X509_get_ext_d2i’
ssl/qsslcertificate.cpp:368:29: warning: cast to pointer from integer of different size [-Wint-to-pointer-cast]
ssl/qsslcertificate.cpp:386:27: error: ‘q_sk_free’ was not declared in this scope
ssl/qsslcertificate.cpp: In function ‘bool matchLineFeed(const QByteArray&, int*)’:
ssl/qsslcertificate.cpp:689:18: warning: value computed is not used [-Wunused-value]
make[1]: *** [.obj/debug-shared/qsslcertificate.o] Error 1
make[1]: Leaving directory `/tmp/qt-x11-opensource-src-4.5.1/src/network'
make: *** [sub-network-make_default-ordered] Error 2
Reply With Quote
  #2  
Old 26th January 2013, 09:34 AM
mamawatoto Offline
Registered User
 
Join Date: Jan 2013
Location: texas
Posts: 1
linuxfirefox
Re: QT Help needed for GNS3

Try adding -no-openssl when you configure.
./configure -nomake examples -nomake demos -qt-gif -no-exceptions -debug -qt3support -no-openssl
Reply With Quote
  #3  
Old 26th January 2013, 10:14 AM
glennzo Online
Un-Retired Administrator
 
Join Date: Mar 2004
Location: Salem, Mass USA
Age: 57
Posts: 14,813
linuxfedorafirefox
Re: QT Help needed for GNS3

Moved to EOL (End Of Life) Versions.
__________________
Glenn
The Bassinator © ®

[SIGPIC][/SIGPIC]
Laptop: Just a couple of old single core units
Desktop: BioStar MCP6PB M2+ / AMD Phenom 9750 Quad Core / 4GB / Kingston HyperX 3K SSD 240GB SATA 3.0 / 1TB SATA / EVGA GeForce 8400 GS 1GB
Reply With Quote
Reply

Tags
gns3, needed

Thread Tools Search this Thread
Search this Thread:

Advanced Search
Display Modes

Posting Rules
You may not post new threads
You may not post replies
You may not post attachments
You may not edit your posts

BB code is On
Smilies are On
[IMG] code is On
HTML code is Off

Forum Jump

Similar Threads
Thread Thread Starter Forum Replies Last Post
GNS3 Problem ! eaglelinux Servers & Networking 0 28th November 2011 03:28 PM
GNS3 Graphical Network Simulator Cannot Run On Fedora15 64bits saithihaaung Fedora Spins & Remixes 2 7th August 2011 05:21 PM
GNS3 Graphical Network Simulator Cannot Run On Fedora15 64bits saithihaaung Using Fedora 1 7th August 2011 04:53 PM
Cannot start GNS3 gnome-terminal in F13 robteh Servers & Networking 2 18th November 2010 06:44 PM
F9 - GNS3 - second loopback adapter bkochis Servers & Networking 0 2nd December 2008 07:49 PM


Current GMT-time: 15:06 (Wednesday, 26-11-2014)

TopSubscribe to XML RSS for all Threads in all ForumsFedoraForumDotOrg Archive
logo

All trademarks, and forum posts in this site are property of their respective owner(s).
FedoraForum.org is privately owned and is not directly sponsored by the Fedora Project or Red Hat, Inc.

Privacy Policy | Term of Use | Posting Guidelines | Archive | Contact Us | Founding Members

Powered by vBulletin® Copyright ©2000 - 2012, vBulletin Solutions, Inc.

FedoraForum is Powered by RedHat
Tsirang Travel Photos - At Tall Photos - Yangshuo Photos